Details

    • Type: Publishing Support
    • Status: Closed
    • Priority: Major
    • Resolution: Duplicate
    • Labels:
    • Environment:
      win10 jdk1.8
    • Group Id:
      null
    • Publishing Hostname:
      oss.sonatype.org
    • Modify publishing permissions?:
      No

      Description

      Downloading from ossrh: https://oss.sonatype.org/content/repositories/snapshots/com/alibaba/nacos/nacos-config/1.4.2-SNAPSHOT/maven-metadata.xml
      Uploading to ossrh: https://oss.sonatype.org/content/repositories/snapshots/com/alibaba/nacos/nacos-config/1.4.2-SNAPSHOT/nacos-config-1.4.2-20210201.084233-1-sources.jar
      [INFO] ------------------------------------------------------------------------
      [INFO] BUILD FAILURE
      [INFO] ------------------------------------------------------------------------
      [INFO] Total time: 19.103 s
      [INFO] Finished at: 2021-02-01T16:42:36+08:00
      [INFO] ------------------------------------------------------------------------
      [ERROR] Failed to execute goal org.sonatype.plugins:nexus-staging-maven-plugin:1.6.8:deploy (injected-nexus-deploy) on project nacos-config: Failed to deploy artifacts: Could not transfer artifact com.alibaba.nacos:nacos-config:jar:sources:1.4.2-20210201.084233-1 from/to ossrh (https://oss.sonatype.org/content/repositories/snapshots): Access denied to: https://oss.sonatype.org/content/repositories/snapshots/com/alibaba/nacos/nacos-config/1.4.2-SNAPSHOT/nacos-config-1.4.2-20210201.084233-1-sources.jar -> [Help 1]
      [ERROR]
      [ERROR] To see the full stack trace of the errors, re-run Maven with the -e switch.
      [ERROR] Re-run Maven using the -X switch to enable full debug logging.
      [ERROR]
      [ERROR] For more information about the errors and possible solutions, please read the following articles:
      [ERROR] [Help 1] http://cwiki.apache.org/confluence/display/MAVEN/MojoExecutionException

        Attachments

          Issue Links

            Activity

              People

              Assignee:
              Unassigned Unassigned
              Reporter:
              lishuang11 李霜
              Votes:
              0 Vote for this issue
              Watchers:
              2 Start watching this issue

                Dates

                Created:
                Updated:
                Resolved:

                  tigCommentSecurity.panel-title