Uploaded image for project: 'Community Support - Open Source Project Repository Hosting'
  1. Community Support - Open Source Project Repository Hosting
  2. OSSRH-62486

[WARNING] TIMEOUT after 302.6 s[ERROR] Rule failure while trying to close staging repository with ID "orgjavalaboratories-1007"

    XMLWordPrintable

    Details

      Description

      Hi Team,

      I attempted to release to the central repository but encountered the following error:

      [INFO]  * Upload of locally staged artifacts finished.
      [INFO]  * Closing staging repository with ID "orgjavalaboratories-1007".Waiting for operation to complete...
      ..................................................................................
      [WARNING] TIMEOUT after 302.6 s[ERROR] Rule failure while trying to close staging repository with ID "orgjavalaboratories-1007".
      [ERROR] 
      [ERROR] Nexus Staging Rules Failure Report
      [ERROR] ==================================
      [ERROR] 
      [ERROR] 
      [ERROR] Cleaning up local stage directory after a Rule failure during close of staging repositories: []
      [ERROR]  * Deleting context 185abe5245525.properties
      [ERROR] Cleaning up remote stage repositories after a Rule failure during close of staging repositories: []
      [ERROR]  * Dropping failed staging repository with ID "orgjavalaboratories-1007" (Rule failure during close of staging repositories: []).Waiting for operation to complete...
      ..........................................................
      [WARNING] TIMEOUT after 301.9 s[INFO] ------------------------------------------------------------------------
      [INFO] BUILD FAILURE
      [INFO] ------------------------------------------------------------------------
      [INFO] Total time: 16:34 min
      [INFO] Finished at: 2020-12-04T12:40:49+00:00
      [INFO] Final Memory: 91M/3066M
      [INFO] ------------------------------------------------------------------------
      [ERROR] Failed to execute goal org.sonatype.plugins:nexus-staging-maven-plugin:1.6.7:deploy (injected-nexus-deploy) on project java-extensions: Execution injected-nexus-deploy of goal org.sonatype.plugins:nexus-staging-maven-plugin:1.6.7:deploy failed: Staging rules failure! -> [Help 1]
      

      I can see the artifacts (org.javalaboratories:java-extensions:1.0.3-RELEASE) have been deployed in Nexus: https://oss.sonatype.org/#nexus-search;quick~javalaboratories, but it is unclear whether the the staging process has finalised properly – there are no rule failures.

      Please can you review the logs to confirm whether the artifacts have been deployed properly and that they will propagate to the maven repository, or perhaps I would need to rerun the deployment?

        Attachments

          Activity

            People

            Assignee:
            jorlina Joel Orlina
            Reporter:
            KevinH Kevin Henry
            Last Updated By:
            Kevin Henry Kevin Henry
            Votes:
            0 Vote for this issue
            Watchers:
            2 Start watching this issue

              Dates

              Created:
              Updated:
              Date of First Response:

                tigCommentSecurity.panel-title