Uploaded image for project: 'Community Support - Open Source Project Repository Hosting'
  1. Community Support - Open Source Project Repository Hosting
  2. OSSRH-58383

Error while Releasing HerdDB 0.16.0 - 408 Request Timeout

    XMLWordPrintable

    Details

    • Type: Task
    • Status: Closed
    • Priority: Major
    • Resolution: Fixed
    • Labels:

      Description

      I cannot perform a release of org.herddb project,

      I have a timeout error during the upload of the very last artifact, that is very small.

      The repository remains in a bad status.

      I have left two open repositories in order to inspect them.

      It is not a network error on my side, all of the other artifacts (several MBs) have been uploaded with success (as you can see in the repositories)

      this is my error:

       

      [INFO] Uploading to ossrh: https://oss.sonatype.org:443/service/local/staging/deployByRepositoryId/orgherddb-1038/org/herddb/herddb-collections/0.16.0/herddb-collections-0.16.0.pom
      [INFO] Progress (1): 4.1/4.8 kB
      [INFO] Progress (1): 4.8 kB    
      [INFO]                     
      [INFO] Uploaded to ossrh: https://oss.sonatype.org:443/service/local/staging/deployByRepositoryId/orgherddb-1038/org/herddb/herddb-collections/0.16.0/herddb-collections-0.16.0.pom (4.8 kB at 3.0 kB/s)
      [INFO] [ERROR] Remote staging finished with a failure: Failed to deploy artifacts: Could not transfer artifact org.herddb:herddb-collections:jar:0.16.0 from/to ossrh (https://oss.sonatype.org:443/service/local/staging/deployByRepositoryId/orgherddb-1038): Transfer failed for https://oss.sonatype.org:443/service/local/staging/deployByRepositoryId/orgherddb-1038/org/herddb/herddb-collections/0.16.0/herddb-collections-0.16.0.jar 408 Request Timeout
      [INFO] [INFO] ------------------------------------------------------------------------
      [INFO] [INFO] Reactor Summary for Herd DB 0.16.0:
      [INFO] [INFO] 
      [INFO] [INFO] Herd DB ............................................ SUCCESS [  3.402 s]
      [INFO] [INFO] HerdDB Utils ....................................... SUCCESS [ 12.204 s]
      [INFO] [INFO] HerdDB Networking .................................. SUCCESS [  3.633 s]
      [INFO] [INFO] HerdDB Core ........................................ SUCCESS [ 13.779 s]
      [INFO] [INFO] HerdDB JDBC Driver ................................. SUCCESS [ 15.073 s]
      [INFO] [INFO] HerdDB Collections Framework. ...................... FAILURE [04:53 min]
      [INFO] [INFO] ------------------------------------------------------------------------
      [INFO] [INFO] BUILD FAILURE
      [INFO] [INFO] ------------------------------------------------------------------------
      [INFO] [INFO] Total time:  05:43 min
      [INFO] [INFO] Finished at: 2020-06-11T09:51:43+02:00
      [INFO] [INFO] ------------------------------------------------------------------------
      [INFO] [ERROR] Failed to execute goal org.sonatype.plugins:nexus-staging-maven-plugin:1.6.8:deploy (injected-nexus-deploy) on project herddb-collections: Remote staging failed: Failed to deploy artifacts: Could not transfer artifact org.herddb:herddb-collections:jar:0.16.0 from/to ossrh (https://oss.sonatype.org:443/service/local/staging/deployByRepositoryId/orgherddb-1038): Transfer failed for https://oss.sonatype.org:443/service/local/staging/deployByRepositoryId/orgherddb-1038/org/herddb/herddb-collections/0.16.0/herddb-collections-0.16.0.jar 408 Request Timeout -> [Help 1]
      [INFO] [ERROR]
      

       

        Attachments

          Activity

            People

            Assignee:
            jorlina Joel Orlina
            Reporter:
            eolivelli Enrico Olivelli
            Last Updated By:
            Joel Orlina
            Votes:
            0 Vote for this issue
            Watchers:
            2 Start watching this issue

              Dates

              Created:
              Updated:
              Resolved:
              Date of First Response:

                tigCommentSecurity.panel-title