Uploaded image for project: 'Community Support - Open Source Project Repository Hosting'
  1. Community Support - Open Source Project Repository Hosting
  2. OSSRH-55584

Rule failure while trying to close staging repository with ID

    XMLWordPrintable

    Details

    • Type: Publishing Support
    • Status: Closed
    • Priority: Major
    • Resolution: Fixed
    • Labels:
    • Group Id:
      null
    • Publishing Hostname:
      oss.sonatype.org
    • Modify publishing permissions?:
      No

      Description

      Hi,

      upload break with:

      [INFO] Uploaded to : https://oss.sonatype.org:443/service/local/staging/deployByRepositoryId/dewenzlaff-1031/de/wenzlaff/command/maven/plugin/de.wenzlaff.command.maven.plugin/0.0.2/de.wenzlaff.command.maven.plugin-0.0.2-sources.jar (5.9 kB at 37 kB/s)
      [INFO] Uploading to : https://oss.sonatype.org:443/service/local/staging/deployByRepositoryId/dewenzlaff-1031/de/wenzlaff/command/maven/plugin/de.wenzlaff.command.maven.plugin/0.0.2/de.wenzlaff.command.maven.plugin-0.0.2-javadoc.jar.asc
      [INFO] Uploaded to : https://oss.sonatype.org:443/service/local/staging/deployByRepositoryId/dewenzlaff-1031/de/wenzlaff/command/maven/plugin/de.wenzlaff.command.maven.plugin/0.0.2/de.wenzlaff.command.maven.plugin-0.0.2-javadoc.jar.asc (455 B at 3.5 kB/s)
      [INFO]  * Upload of locally staged artifacts finished.
      [INFO]  * Closing staging repository with ID "dewenzlaff-1031".Waiting for operation to complete......................................................................
      [WARNING] TIMEOUT[ERROR] Rule failure while trying to close staging repository with ID "dewenzlaff-1031".
      [ERROR] 
      [ERROR] Nexus Staging Rules Failure Report
      [ERROR] ==================================
      [ERROR] 
      [ERROR] 
      [ERROR] Cleaning up local stage directory after a Rule failure during close of staging repositories: []
      [ERROR]  * Deleting context 297d830924ea60.properties
      [ERROR] Cleaning up remote stage repositories after a Rule failure during close of staging repositories: []
      [ERROR]  * Dropping failed staging repository with ID "dewenzlaff-1031" (Rule failure during close of staging repositories: []).Waiting for operation to complete...........................[ERROR] Remote staging finished with a failure: Staging rules failure!
      [INFO] ------------------------------------------------------------------------
      [INFO] BUILD FAILURE
      [INFO] ------------------------------------------------------------------------
      [INFO] Total time:  09:54 min
      [INFO] Finished at: 2020-03-04T21:49:56+01:00
      [INFO] ------------------------------------------------------------------------
      [ERROR] Failed to execute goal org.sonatype.plugins:nexus-staging-maven-plugin:1.6.3:deploy (injected-nexus-deploy) on project de.wenzlaff.command.maven.plugin: Remote staging failed: Staging rules failure! -> [Help 1]
      [ERROR] 
      [ERROR] To see the full stack trace of the errors, re-run Maven with the -e switch.
      [ERROR] Re-run Maven using the -X switch to enable full debug logging.
      [ERROR] 
      [ERROR] For more information about the errors and possible solutions, please read the following articles:
      [ERROR] [Help 1] http://cwiki.apache.org/confluence/display/MAVEN/MojoExecutionException
      
      

      Please help.

       

        Attachments

          Activity

            People

            Assignee:
            jorlina Joel Orlina
            Reporter:
            TWBuild Thomas Wenzlaff
            Votes:
            0 Vote for this issue
            Watchers:
            2 Start watching this issue

              Dates

              Created:
              Updated:
              Resolved:

                tigCommentSecurity.panel-title