Uploaded image for project: 'Community Support - Open Source Project Repository Hosting'
  1. Community Support - Open Source Project Repository Hosting
  2. OSSRH-51316

504 Gateway Time-out when releasing artifact nats-streaming-embedded

    XMLWordPrintable

    Details

    • Group Id:
      null
    • Publishing Hostname:
      oss.sonatype.org
    • Modify publishing permissions?:
      No

      Description

      I get the error 504 Gateway Time-out when publishing version 0.0.3 of my project nats-streaming-embedded.

      I have tried two different internet connections, but none is working.

       

      This is the error message:

      ATVIEM4043557A:stan-testing bernhard.vollnhofer$ mvn clean deploy
      [INFO] Scanning for projects...
      {{[WARNING] }}
      [WARNING] Some problems were encountered while building the effective model for io.github.carlowakefield:nats-streaming-embedded:jar:0.0.3
      [WARNING] 'build.plugins.plugin.version' for org.sonatype.plugins:nexus-staging-maven-plugin is missing. @ line 90, column 21
      {{[WARNING] }}
      [WARNING] It is highly recommended to fix these problems because they threaten the stability of your build.
      {{[WARNING] }}
      [WARNING] For this reason, future Maven versions might no longer support building such malformed projects.
      {{[WARNING] }}
      [INFO] Inspecting build with total of 1 modules...
      [INFO] Installing Nexus Staging features:
      [INFO] ... total of 1 executions of maven-deploy-plugin replaced with nexus-staging-maven-plugin
      {{[INFO] }}
      [INFO] ---------< io.github.carlowakefield:nats-streaming-embedded >---------
      [INFO] Building io.github.carlowakefield:nats-streaming-embedded 0.0.3
      [INFO] -------------------------------[ jar ]--------------------------------
      {{[INFO] }}
      [INFO] — maven-clean-plugin:2.5:clean (default-clean) @ nats-streaming-embedded ---
      [INFO] Deleting /Users/bernhard.vollnhofer/Projekte/stan-testing/target
      {{[INFO] }}
      [INFO] — maven-resources-plugin:2.6:resources (default-resources) @ nats-streaming-embedded ---
      [INFO] Using 'UTF-8' encoding to copy filtered resources.
      [INFO] Copying 0 resource
      {{[INFO] }}
      [INFO] — maven-compiler-plugin:3.8.1:compile (default-compile) @ nats-streaming-embedded ---
      [INFO] Changes detected - recompiling the module!
      [INFO] Compiling 5 source files to /Users/bernhard.vollnhofer/Projekte/stan-testing/target/classes
      {{[INFO] }}
      [INFO] — maven-resources-plugin:2.6:testResources (default-testResources) @ nats-streaming-embedded ---
      [INFO] Using 'UTF-8' encoding to copy filtered resources.
      [INFO] skip non existing resourceDirectory /Users/bernhard.vollnhofer/Projekte/stan-testing/src/test/resources
      {{[INFO] }}
      [INFO] — maven-compiler-plugin:3.8.1:testCompile (default-testCompile) @ nats-streaming-embedded ---
      [INFO] Changes detected - recompiling the module!
      [INFO] Compiling 3 source files to /Users/bernhard.vollnhofer/Projekte/stan-testing/target/test-classes
      {{[INFO] }}
      [INFO] — maven-surefire-plugin:2.12.4:test (default-test) @ nats-streaming-embedded ---
      [INFO] Surefire report directory: /Users/bernhard.vollnhofer/Projekte/stan-testing/target/surefire-reports-------------------------------------------------------
      {{ T E S T S}}
      -------------------------------------------------------
      Running carlowakefield.nats.streaming.embedded.integration.NatsStreamingEmbeddedTest
      15:38:52.803 [main] DEBUG carlowakefield.nats.streaming.embedded.CommandFactory - path /var/folders/xr/x2_7mvq96ng4v8qsljqvl49h0000gn/T/nats-streaming-server-v0.16.0-darwin-amd64/nats-streaming-server already exists, no need to download
      15:38:52.807 [main] DEBUG carlowakefield.nats.streaming.embedded.NatsStreamingEmbedded - calling /var/folders/xr/x2_7mvq96ng4v8qsljqvl49h0000gn/T/nats-streaming-server-v0.16.0-darwin-amd64/nats-streaming-server
      15:38:52.829 [Exec Stream Pumper] DEBUG carlowakefield.nats.streaming.embedded.NatsStreamingEmbedded - [445] 2019/09/04 15:38:52.827840 [INF] STREAM: Starting nats-streaming-server[test-cluster] version 0.16.0
      15:38:52.829 [Exec Stream Pumper] DEBUG carlowakefield.nats.streaming.embedded.NatsStreamingEmbedded - [445] 2019/09/04 15:38:52.827965 [INF] STREAM: ServerID: b046lVyn16hdQxPXnos7sL
      15:38:52.829 [Exec Stream Pumper] DEBUG carlowakefield.nats.streaming.embedded.NatsStreamingEmbedded - [445] 2019/09/04 15:38:52.827967 [INF] STREAM: Go version: go1.11.13
      15:38:52.829 [Exec Stream Pumper] DEBUG carlowakefield.nats.streaming.embedded.NatsStreamingEmbedded - [445] 2019/09/04 15:38:52.827969 [INF] STREAM: Git commit: [27593aa]
      15:38:52.829 [Exec Stream Pumper] DEBUG carlowakefield.nats.streaming.embedded.NatsStreamingEmbedded - [445] 2019/09/04 15:38:52.828815 [INF] Starting nats-server version 2.0.4
      15:38:52.829 [Exec Stream Pumper] DEBUG carlowakefield.nats.streaming.embedded.NatsStreamingEmbedded - [445] 2019/09/04 15:38:52.828824 [INF] Git commit [c8ca58e]
      15:38:52.829 [Exec Stream Pumper] DEBUG carlowakefield.nats.streaming.embedded.NatsStreamingEmbedded - [445] 2019/09/04 15:38:52.829112 [INF] Listening for client connections on 0.0.0.0:4222
      15:38:52.829 [Exec Stream Pumper] DEBUG carlowakefield.nats.streaming.embedded.NatsStreamingEmbedded - [445] 2019/09/04 15:38:52.829118 [INF] Server id is NBTF2HID36VOUSA4QDHEQ77DN3CC7MUKIMSMZNEBAALOLPMPHNUEQEMY
      15:38:52.829 [Exec Stream Pumper] DEBUG carlowakefield.nats.streaming.embedded.NatsStreamingEmbedded - [445] 2019/09/04 15:38:52.829121 [INF] Server is ready
      15:38:52.859 [Exec Stream Pumper] DEBUG carlowakefield.nats.streaming.embedded.NatsStreamingEmbedded - [445] 2019/09/04 15:38:52.859240 [INF] STREAM: Recovering the state...
      15:38:52.859 [Exec Stream Pumper] DEBUG carlowakefield.nats.streaming.embedded.NatsStreamingEmbedded - [445] 2019/09/04 15:38:52.859254 [INF] STREAM: No recovered state
      15:38:53.110 [Exec Stream Pumper] DEBUG carlowakefield.nats.streaming.embedded.NatsStreamingEmbedded - [445] 2019/09/04 15:38:53.110133 [INF] STREAM: Message store is MEMORY
      15:38:53.110 [Exec Stream Pumper] DEBUG carlowakefield.nats.streaming.embedded.NatsStreamingEmbedded - [445] 2019/09/04 15:38:53.110196 [INF] STREAM: ---------- Store Limits ----------
      15:38:53.110 [Exec Stream Pumper] DEBUG carlowakefield.nats.streaming.embedded.NatsStreamingEmbedded - [445] 2019/09/04 15:38:53.110201 [INF] STREAM: Channels: 100 *
      15:38:53.110 [Exec Stream Pumper] DEBUG carlowakefield.nats.streaming.embedded.NatsStreamingEmbedded - [445] 2019/09/04 15:38:53.110204 [INF] STREAM: --------- Channels Limits --------
      15:38:53.110 [Exec Stream Pumper] DEBUG carlowakefield.nats.streaming.embedded.NatsStreamingEmbedded - [445] 2019/09/04 15:38:53.110206 [INF] STREAM: Subscriptions: 1000 *
      15:38:53.110 [Exec Stream Pumper] DEBUG carlowakefield.nats.streaming.embedded.NatsStreamingEmbedded - [445] 2019/09/04 15:38:53.110209 [INF] STREAM: Messages : 1000000 *
      15:38:53.110 [Exec Stream Pumper] DEBUG carlowakefield.nats.streaming.embedded.NatsStreamingEmbedded - [445] 2019/09/04 15:38:53.110211 [INF] STREAM: Bytes : 976.56 MB *
      15:38:53.110 [Exec Stream Pumper] DEBUG carlowakefield.nats.streaming.embedded.NatsStreamingEmbedded - [445] 2019/09/04 15:38:53.110214 [INF] STREAM: Age : unlimited *
      15:38:53.110 [Exec Stream Pumper] DEBUG carlowakefield.nats.streaming.embedded.NatsStreamingEmbedded - [445] 2019/09/04 15:38:53.110218 [INF] STREAM: Inactivity : unlimited *
      15:38:53.111 [Exec Stream Pumper] DEBUG carlowakefield.nats.streaming.embedded.NatsStreamingEmbedded - [445] 2019/09/04 15:38:53.110221 [INF] STREAM: ----------------------------------
      15:38:53.281 [main] DEBUG carlowakefield.nats.streaming.embedded.NatsStreamingEmbedded - shutting down NATS Streaming Server
      15:38:53.388 [main] DEBUG carlowakefield.nats.streaming.embedded.NatsStreamingEmbedded - NATS Streaming Server exit value: 141
      Tests run: 2, Failures: 0, Errors: 0, Skipped: 0, Time elapsed: 0.748 sec
      Running carlowakefield.nats.streaming.embedded.integration.NatsStreamingEmbeddedSecondTest
      15:38:53.389 [main] DEBUG carlowakefield.nats.streaming.embedded.CommandFactory - path /var/folders/xr/x2_7mvq96ng4v8qsljqvl49h0000gn/T/nats-streaming-server-v0.16.0-darwin-amd64/nats-streaming-server already exists, no need to download
      15:38:53.389 [main] DEBUG carlowakefield.nats.streaming.embedded.NatsStreamingEmbedded - calling /var/folders/xr/x2_7mvq96ng4v8qsljqvl49h0000gn/T/nats-streaming-server-v0.16.0-darwin-amd64/nats-streaming-server
      15:38:53.403 [Exec Stream Pumper] DEBUG carlowakefield.nats.streaming.embedded.NatsStreamingEmbedded - [446] 2019/09/04 15:38:53.403235 [INF] STREAM: Starting nats-streaming-server[test-cluster] version 0.16.0
      15:38:53.403 [Exec Stream Pumper] DEBUG carlowakefield.nats.streaming.embedded.NatsStreamingEmbedded - [446] 2019/09/04 15:38:53.403320 [INF] STREAM: ServerID: he1fKYK8ylaGkCwPY8lHDS
      15:38:53.403 [Exec Stream Pumper] DEBUG carlowakefield.nats.streaming.embedded.NatsStreamingEmbedded - [446] 2019/09/04 15:38:53.403322 [INF] STREAM: Go version: go1.11.13
      15:38:53.403 [Exec Stream Pumper] DEBUG carlowakefield.nats.streaming.embedded.NatsStreamingEmbedded - [446] 2019/09/04 15:38:53.403324 [INF] STREAM: Git commit: [27593aa]
      15:38:53.404 [Exec Stream Pumper] DEBUG carlowakefield.nats.streaming.embedded.NatsStreamingEmbedded - [446] 2019/09/04 15:38:53.404153 [INF] Starting nats-server version 2.0.4
      15:38:53.404 [Exec Stream Pumper] DEBUG carlowakefield.nats.streaming.embedded.NatsStreamingEmbedded - [446] 2019/09/04 15:38:53.404160 [INF] Git commit [c8ca58e]
      15:38:53.404 [Exec Stream Pumper] DEBUG carlowakefield.nats.streaming.embedded.NatsStreamingEmbedded - [446] 2019/09/04 15:38:53.404401 [INF] Listening for client connections on 0.0.0.0:4222
      15:38:53.404 [Exec Stream Pumper] DEBUG carlowakefield.nats.streaming.embedded.NatsStreamingEmbedded - [446] 2019/09/04 15:38:53.404405 [INF] Server id is NCCIKJZUNYPSWDEXHF5IYFF7I3VMUCXDBRNCAS57UOXYE6UPHWESATNV
      15:38:53.404 [Exec Stream Pumper] DEBUG carlowakefield.nats.streaming.embedded.NatsStreamingEmbedded - [446] 2019/09/04 15:38:53.404407 [INF] Server is ready
      15:38:53.434 [Exec Stream Pumper] DEBUG carlowakefield.nats.streaming.embedded.NatsStreamingEmbedded - [446] 2019/09/04 15:38:53.434409 [INF] STREAM: Recovering the state...
      15:38:53.434 [Exec Stream Pumper] DEBUG carlowakefield.nats.streaming.embedded.NatsStreamingEmbedded - [446] 2019/09/04 15:38:53.434458 [INF] STREAM: No recovered state
      15:38:53.686 [Exec Stream Pumper] DEBUG carlowakefield.nats.streaming.embedded.NatsStreamingEmbedded - [446] 2019/09/04 15:38:53.686385 [INF] STREAM: Message store is MEMORY
      15:38:53.686 [Exec Stream Pumper] DEBUG carlowakefield.nats.streaming.embedded.NatsStreamingEmbedded - [446] 2019/09/04 15:38:53.686456 [INF] STREAM: ---------- Store Limits ----------
      15:38:53.686 [Exec Stream Pumper] DEBUG carlowakefield.nats.streaming.embedded.NatsStreamingEmbedded - [446] 2019/09/04 15:38:53.686461 [INF] STREAM: Channels: 100 *
      15:38:53.686 [Exec Stream Pumper] DEBUG carlowakefield.nats.streaming.embedded.NatsStreamingEmbedded - [446] 2019/09/04 15:38:53.686464 [INF] STREAM: --------- Channels Limits --------
      15:38:53.687 [Exec Stream Pumper] DEBUG carlowakefield.nats.streaming.embedded.NatsStreamingEmbedded - [446] 2019/09/04 15:38:53.686468 [INF] STREAM: Subscriptions: 1000 *
      15:38:53.687 [Exec Stream Pumper] DEBUG carlowakefield.nats.streaming.embedded.NatsStreamingEmbedded - [446] 2019/09/04 15:38:53.686471 [INF] STREAM: Messages : 1000000 *
      15:38:53.687 [Exec Stream Pumper] DEBUG carlowakefield.nats.streaming.embedded.NatsStreamingEmbedded - [446] 2019/09/04 15:38:53.686474 [INF] STREAM: Bytes : 976.56 MB *
      15:38:53.687 [Exec Stream Pumper] DEBUG carlowakefield.nats.streaming.embedded.NatsStreamingEmbedded - [446] 2019/09/04 15:38:53.686477 [INF] STREAM: Age : unlimited *
      15:38:53.687 [Exec Stream Pumper] DEBUG carlowakefield.nats.streaming.embedded.NatsStreamingEmbedded - [446] 2019/09/04 15:38:53.686483 [INF] STREAM: Inactivity : unlimited *
      15:38:53.687 [Exec Stream Pumper] DEBUG carlowakefield.nats.streaming.embedded.NatsStreamingEmbedded - [446] 2019/09/04 15:38:53.686486 [INF] STREAM: ----------------------------------
      15:38:53.722 [main] DEBUG carlowakefield.nats.streaming.embedded.NatsStreamingEmbedded - shutting down NATS Streaming Server
      15:38:53.825 [main] DEBUG carlowakefield.nats.streaming.embedded.NatsStreamingEmbedded - NATS Streaming Server exit value: 0
      Tests run: 2, Failures: 0, Errors: 0, Skipped: 0, Time elapsed: 0.43 secResults :Tests run: 4, Failures: 0, Errors: 0, Skipped: 0{{[INFO] }}
      [INFO] — maven-jar-plugin:2.4:jar (default-jar) @ nats-streaming-embedded ---
      [INFO] Building jar: /Users/bernhard.vollnhofer/Projekte/stan-testing/target/nats-streaming-embedded-0.0.3.jar
      {{[INFO] }}
      [INFO] >>> maven-source-plugin:3.1.0:jar (attach-sources) > generate-sources @ nats-streaming-embedded >>>
      {{[INFO] }}
      [INFO] <<< maven-source-plugin:3.1.0:jar (attach-sources) < generate-sources @ nats-streaming-embedded <<<
      {{[INFO] }}
      {{[INFO] }}
      [INFO] — maven-source-plugin:3.1.0:jar (attach-sources) @ nats-streaming-embedded ---
      [INFO] Building jar: /Users/bernhard.vollnhofer/Projekte/stan-testing/target/nats-streaming-embedded-0.0.3-sources.jar
      {{[INFO] }}
      [INFO] — maven-javadoc-plugin:3.1.1:jar (attach-javadocs) @ nats-streaming-embedded ---
      {{[INFO] }}
      Loading source files for package carlowakefield.nats.streaming.embedded.download...
      Loading source files for package carlowakefield.nats.streaming.embedded...
      Constructing Javadoc information...
      Standard Doclet version 11.0.4
      Building tree for all the packages and classes...
      Generating /Users/bernhard.vollnhofer/Projekte/stan-testing/target/apidocs/carlowakefield/nats/streaming/embedded/NatsStreamingEmbedded.html...
      Generating /Users/bernhard.vollnhofer/Projekte/stan-testing/target/apidocs/carlowakefield/nats/streaming/embedded/download/FilenameFactory.html...
      Generating /Users/bernhard.vollnhofer/Projekte/stan-testing/target/apidocs/carlowakefield/nats/streaming/embedded/download/ServerDownloader.html...
      Generating /Users/bernhard.vollnhofer/Projekte/stan-testing/target/apidocs/carlowakefield/nats/streaming/embedded/package-summary.html...
      Generating /Users/bernhard.vollnhofer/Projekte/stan-testing/target/apidocs/carlowakefield/nats/streaming/embedded/package-tree.html...
      Generating /Users/bernhard.vollnhofer/Projekte/stan-testing/target/apidocs/carlowakefield/nats/streaming/embedded/download/package-summary.html...
      Generating /Users/bernhard.vollnhofer/Projekte/stan-testing/target/apidocs/carlowakefield/nats/streaming/embedded/download/package-tree.html...
      Generating /Users/bernhard.vollnhofer/Projekte/stan-testing/target/apidocs/constant-values.html...
      Generating /Users/bernhard.vollnhofer/Projekte/stan-testing/target/apidocs/carlowakefield/nats/streaming/embedded/download/class-use/FilenameFactory.html...
      Generating /Users/bernhard.vollnhofer/Projekte/stan-testing/target/apidocs/carlowakefield/nats/streaming/embedded/download/class-use/ServerDownloader.html...
      Generating /Users/bernhard.vollnhofer/Projekte/stan-testing/target/apidocs/carlowakefield/nats/streaming/embedded/class-use/NatsStreamingEmbedded.html...
      Generating /Users/bernhard.vollnhofer/Projekte/stan-testing/target/apidocs/carlowakefield/nats/streaming/embedded/package-use.html...
      Generating /Users/bernhard.vollnhofer/Projekte/stan-testing/target/apidocs/carlowakefield/nats/streaming/embedded/download/package-use.html...
      Building index for all the packages and classes...
      Generating /Users/bernhard.vollnhofer/Projekte/stan-testing/target/apidocs/overview-tree.html...
      Generating /Users/bernhard.vollnhofer/Projekte/stan-testing/target/apidocs/index-all.html...
      Building index for all classes...
      Generating /Users/bernhard.vollnhofer/Projekte/stan-testing/target/apidocs/allclasses-index.html...
      Generating /Users/bernhard.vollnhofer/Projekte/stan-testing/target/apidocs/allpackages-index.html...
      Generating /Users/bernhard.vollnhofer/Projekte/stan-testing/target/apidocs/deprecated-list.html...
      Building index for all classes...
      Generating /Users/bernhard.vollnhofer/Projekte/stan-testing/target/apidocs/allclasses.html...
      Generating /Users/bernhard.vollnhofer/Projekte/stan-testing/target/apidocs/allclasses.html...
      Generating /Users/bernhard.vollnhofer/Projekte/stan-testing/target/apidocs/index.html...
      Generating /Users/bernhard.vollnhofer/Projekte/stan-testing/target/apidocs/overview-summary.html...
      Generating /Users/bernhard.vollnhofer/Projekte/stan-testing/target/apidocs/help-doc.html...
      [INFO] Building jar: /Users/bernhard.vollnhofer/Projekte/stan-testing/target/nats-streaming-embedded-0.0.3-javadoc.jar
      {{[INFO] }}
      [INFO] — maven-gpg-plugin:1.6:sign (sign-artifacts) @ nats-streaming-embedded ---
      {{[INFO] }}
      [INFO] — maven-install-plugin:2.4:install (default-install) @ nats-streaming-embedded ---
      [INFO] Installing /Users/bernhard.vollnhofer/Projekte/stan-testing/target/nats-streaming-embedded-0.0.3.jar to /Users/bernhard.vollnhofer/.m2/repository/io/github/carlowakefield/nats-streaming-embedded/0.0.3/nats-streaming-embedded-0.0.3.jar
      [INFO] Installing /Users/bernhard.vollnhofer/Projekte/stan-testing/pom.xml to /Users/bernhard.vollnhofer/.m2/repository/io/github/carlowakefield/nats-streaming-embedded/0.0.3/nats-streaming-embedded-0.0.3.pom
      [INFO] Installing /Users/bernhard.vollnhofer/Projekte/stan-testing/target/nats-streaming-embedded-0.0.3-sources.jar to /Users/bernhard.vollnhofer/.m2/repository/io/github/carlowakefield/nats-streaming-embedded/0.0.3/nats-streaming-embedded-0.0.3-sources.jar
      [INFO] Installing /Users/bernhard.vollnhofer/Projekte/stan-testing/target/nats-streaming-embedded-0.0.3-javadoc.jar to /Users/bernhard.vollnhofer/.m2/repository/io/github/carlowakefield/nats-streaming-embedded/0.0.3/nats-streaming-embedded-0.0.3-javadoc.jar
      [INFO] Installing /Users/bernhard.vollnhofer/Projekte/stan-testing/target/nats-streaming-embedded-0.0.3.jar.asc to /Users/bernhard.vollnhofer/.m2/repository/io/github/carlowakefield/nats-streaming-embedded/0.0.3/nats-streaming-embedded-0.0.3.jar.asc
      [INFO] Installing /Users/bernhard.vollnhofer/Projekte/stan-testing/target/nats-streaming-embedded-0.0.3.pom.asc to /Users/bernhard.vollnhofer/.m2/repository/io/github/carlowakefield/nats-streaming-embedded/0.0.3/nats-streaming-embedded-0.0.3.pom.asc
      [INFO] Installing /Users/bernhard.vollnhofer/Projekte/stan-testing/target/nats-streaming-embedded-0.0.3-sources.jar.asc to /Users/bernhard.vollnhofer/.m2/repository/io/github/carlowakefield/nats-streaming-embedded/0.0.3/nats-streaming-embedded-0.0.3-sources.jar.asc
      [INFO] Installing /Users/bernhard.vollnhofer/Projekte/stan-testing/target/nats-streaming-embedded-0.0.3-javadoc.jar.asc to /Users/bernhard.vollnhofer/.m2/repository/io/github/carlowakefield/nats-streaming-embedded/0.0.3/nats-streaming-embedded-0.0.3-javadoc.jar.asc
      {{[INFO] }}
      [INFO] — nexus-staging-maven-plugin:1.6.8:deploy (injected-nexus-deploy) @ nats-streaming-embedded ---
      [INFO] Performing local staging (local stagingDirectory="/Users/bernhard.vollnhofer/Projekte/stan-testing/target/nexus-staging/staging")...
      [INFO] + Using server credentials "ossrh" from Maven settings.
      WARNING: An illegal reflective access operation has occurred
      WARNING: Illegal reflective access by com.thoughtworks.xstream.core.util.Fields (file:/Users/bernhard.vollnhofer/.m2/repository/com/thoughtworks/xstream/xstream/1.4.7/xstream-1.4.7.jar) to field java.util.TreeMap.comparator
      WARNING: Please consider reporting this to the maintainers of com.thoughtworks.xstream.core.util.Fields
      WARNING: Use --illegal-access=warn to enable warnings of further illegal reflective access operations
      WARNING: All illegal access operations will be denied in a future release
      [INFO] * Connected to Nexus at https://oss.sonatype.org:443/, is version 2.14.14-01 and edition "Professional"
      [INFO] * Using staging profile ID "d3d05762b185f3" (matched by Nexus).
      [INFO] Installing /Users/bernhard.vollnhofer/Projekte/stan-testing/target/nats-streaming-embedded-0.0.3.jar to /Users/bernhard.vollnhofer/Projekte/stan-testing/target/nexus-staging/staging/d3d05762b185f3/io/github/carlowakefield/nats-streaming-embedded/0.0.3/nats-streaming-embedded-0.0.3.jar
      [INFO] Installing /Users/bernhard.vollnhofer/Projekte/stan-testing/pom.xml to /Users/bernhard.vollnhofer/Projekte/stan-testing/target/nexus-staging/staging/d3d05762b185f3/io/github/carlowakefield/nats-streaming-embedded/0.0.3/nats-streaming-embedded-0.0.3.pom
      [INFO] Installing /Users/bernhard.vollnhofer/Projekte/stan-testing/target/nats-streaming-embedded-0.0.3-sources.jar to /Users/bernhard.vollnhofer/Projekte/stan-testing/target/nexus-staging/staging/d3d05762b185f3/io/github/carlowakefield/nats-streaming-embedded/0.0.3/nats-streaming-embedded-0.0.3-sources.jar
      [INFO] Installing /Users/bernhard.vollnhofer/Projekte/stan-testing/target/nats-streaming-embedded-0.0.3-javadoc.jar to /Users/bernhard.vollnhofer/Projekte/stan-testing/target/nexus-staging/staging/d3d05762b185f3/io/github/carlowakefield/nats-streaming-embedded/0.0.3/nats-streaming-embedded-0.0.3-javadoc.jar
      [INFO] Installing /Users/bernhard.vollnhofer/Projekte/stan-testing/target/nats-streaming-embedded-0.0.3.jar.asc to /Users/bernhard.vollnhofer/Projekte/stan-testing/target/nexus-staging/staging/d3d05762b185f3/io/github/carlowakefield/nats-streaming-embedded/0.0.3/nats-streaming-embedded-0.0.3.jar.asc
      [INFO] Installing /Users/bernhard.vollnhofer/Projekte/stan-testing/target/nats-streaming-embedded-0.0.3.pom.asc to /Users/bernhard.vollnhofer/Projekte/stan-testing/target/nexus-staging/staging/d3d05762b185f3/io/github/carlowakefield/nats-streaming-embedded/0.0.3/nats-streaming-embedded-0.0.3.pom.asc
      [INFO] Installing /Users/bernhard.vollnhofer/Projekte/stan-testing/target/nats-streaming-embedded-0.0.3-sources.jar.asc to /Users/bernhard.vollnhofer/Projekte/stan-testing/target/nexus-staging/staging/d3d05762b185f3/io/github/carlowakefield/nats-streaming-embedded/0.0.3/nats-streaming-embedded-0.0.3-sources.jar.asc
      [INFO] Installing /Users/bernhard.vollnhofer/Projekte/stan-testing/target/nats-streaming-embedded-0.0.3-javadoc.jar.asc to /Users/bernhard.vollnhofer/Projekte/stan-testing/target/nexus-staging/staging/d3d05762b185f3/io/github/carlowakefield/nats-streaming-embedded/0.0.3/nats-streaming-embedded-0.0.3-javadoc.jar.asc
      [INFO] Performing remote staging...
      {{[INFO] }}
      [INFO] * Remote staging into staging profile ID "d3d05762b185f3"
      Sep. 04, 2019 3:45:40 NACHM. com.sun.jersey.api.client.ClientResponse getEntity
      SEVERE: A message body reader for Java class com.sonatype.nexus.staging.api.dto.StagingRuleFailuresDTO, and Java type class com.sonatype.nexus.staging.api.dto.StagingRuleFailuresDTO, and MIME media type text/html was not found
      Sep. 04, 2019 3:45:40 NACHM. com.sun.jersey.api.client.ClientResponse getEntity
      SEVERE: The registered message body readers compatible with the MIME media type are:
      / ->
      {{ com.sun.jersey.core.impl.provider.entity.FormProvider}}
      {{ com.sun.jersey.core.impl.provider.entity.StringProvider}}
      {{ com.sun.jersey.core.impl.provider.entity.ByteArrayProvider}}
      {{ com.sun.jersey.core.impl.provider.entity.FileProvider}}
      {{ com.sun.jersey.core.impl.provider.entity.InputStreamProvider}}
      {{ com.sun.jersey.core.impl.provider.entity.ReaderProvider}}
      {{ com.sun.jersey.core.impl.provider.entity.DocumentProvider}}
      {{ com.sun.jersey.core.impl.provider.entity.SourceProvider$StreamSourceReader}}
      {{ com.sun.jersey.core.impl.provider.entity.SourceProvider$SAXSourceReader}}
      {{ com.sun.jersey.core.impl.provider.entity.SourceProvider$DOMSourceReader}}
      {{ com.sun.jersey.core.impl.provider.entity.EntityHolderReader}}
      {{ com.fasterxml.jackson.jaxrs.json.JacksonJsonProvider}}[ERROR] Remote staging finished with a failure: Gateway Timeout : entity body dump follows: <html>
      <head><title>504 Gateway Time-out</title></head>
      <body>
      <center><h1>504 Gateway Time-out</h1></center>
      <hr><center>nginx</center>
      </body>
      </html>[INFO] ------------------------------------------------------------------------
      [INFO] BUILD FAILURE
      [INFO] ------------------------------------------------------------------------
      [INFO] Total time: 06:50 min
      [INFO] Finished at: 2019-09-04T15:45:40+02:00
      [INFO] ------------------------------------------------------------------------
      [ERROR] Failed to execute goal org.sonatype.plugins:nexus-staging-maven-plugin:1.6.8:deploy (injected-nexus-deploy) on project nats-streaming-embedded: Remote staging failed: Gateway Timeout : entity body dump follows: <html>
      [ERROR] <head><title>504 Gateway Time-out</title></head>
      [ERROR] <body>
      [ERROR] <center><h1>504 Gateway Time-out</h1></center>
      [ERROR] <hr><center>nginx</center>
      [ERROR] </body>
      [ERROR] </html>
      {{[ERROR] }}
      [ERROR] -> [Help 1]
      {{[ERROR] }}
      [ERROR] To see the full stack trace of the errors, re-run Maven with the -e switch.
      [ERROR] Re-run Maven using the -X switch to enable full debug logging.
      {{[ERROR] }}
      [ERROR] For more information about the errors and possible solutions, please read the following articles:
      [ERROR] [Help 1] http://cwiki.apache.org/confluence/display/MAVEN/MojoExecutionException

        Attachments

          Activity

            People

            Assignee:
            jorlina Joel Orlina
            Reporter:
            CarloWakefield Bernhard Vollnhofer
            Votes:
            1 Vote for this issue
            Watchers:
            8 Start watching this issue

              Dates

              Created:
              Updated:
              Resolved:

                tigCommentSecurity.panel-title