Uploaded image for project: 'Community Support - Open Source Project Repository Hosting'
  1. Community Support - Open Source Project Repository Hosting
  2. OSSRH-43229

[ERROR] Remote staging finished with a failure: Internal error! Line "org.jboss.forge.roaster:roaster-bom:2.20.2.Final:n/a:pom:pom:n/a:n/a" does not match pattern "([^:]*):([^:]*):([^:]*):([^:]*):([^:]*):([^:]*):([^:]*):([^:]*):([^:]*):(.*)"?

    XMLWordPrintable

    Details

    • Type: Publishing Support
    • Status: Closed
    • Priority: Major
    • Resolution: Automatically Closed
    • Labels:
      None
    • Group Id:
      null
    • Publishing Hostname:
      oss.sonatype.org
    • Modify publishing permissions?:
      No

      Description

      I am trying to release https://github.com/forge/roaster but I get the following error when running mvn release:perform:

      [INFO] [INFO] --- nexus-staging-maven-plugin:1.6.8:deploy (injected-nexus-deploy) @ roaster-tests ---
      [INFO] [INFO] Performing local staging (local stagingDirectory="/home/ggastald/workspace/roaster/target/checkout/target/nexus-staging/staging")...
      [INFO] [INFO] + Using server credentials "ossrh" from Maven settings.
      [INFO] [INFO] * Connected to Nexus at https://oss.sonatype.org:443/, is version 2.14.10-01 and edition "Professional"
      [INFO] [INFO] * Using staging profile ID "53d3e38e38909d" (matched by Nexus).
      [INFO] [INFO] Installing /home/ggastald/workspace/roaster/target/checkout/tests/target/roaster-tests-2.20.2.Final.jar to /home/ggastald/workspace/roaster/target/checkout/target/nexus-staging/staging/53d3e38e38909d/org/jboss/forge/roaster/roaster-tests/2.20.2.Final/roaster-tests-2.20.2.Final.jar
      [INFO] [INFO] Installing /home/ggastald/workspace/roaster/target/checkout/tests/pom.xml to /home/ggastald/workspace/roaster/target/checkout/target/nexus-staging/staging/53d3e38e38909d/org/jboss/forge/roaster/roaster-tests/2.20.2.Final/roaster-tests-2.20.2.Final.pom
      [INFO] [INFO] Installing /home/ggastald/workspace/roaster/target/checkout/tests/target/roaster-tests-2.20.2.Final.jar.asc to /home/ggastald/workspace/roaster/target/checkout/target/nexus-staging/staging/53d3e38e38909d/org/jboss/forge/roaster/roaster-tests/2.20.2.Final/roaster-tests-2.20.2.Final.jar.asc
      [INFO] [INFO] Installing /home/ggastald/workspace/roaster/target/checkout/tests/target/roaster-tests-2.20.2.Final.pom.asc to /home/ggastald/workspace/roaster/target/checkout/target/nexus-staging/staging/53d3e38e38909d/org/jboss/forge/roaster/roaster-tests/2.20.2.Final/roaster-tests-2.20.2.Final.pom.asc
      [INFO] [INFO] Performing remote staging...
      [INFO] [INFO] 
      [INFO] [INFO] * Remote staging into staging profile ID "53d3e38e38909d"
      [INFO] [INFO] * Created staging repository with ID "orgjbossforge-1214".
      [INFO] [INFO] * Staging repository at https://oss.sonatype.org:443/service/local/staging/deployByRepositoryId/orgjbossforge-1214
      [INFO] [INFO] * Uploading locally staged artifacts to profile org.jboss.forge
      [INFO] Uploading to ossrh: https://oss.sonatype.org:443/service/local/staging/deployByRepositoryId/orgjbossforge-1214/org/jboss/forge/roaster/roaster-distribution/2.20.2.Final/roaster-distribution-2.20.2.Final.pom.asc
      [INFO] Progress (1): 488 B
      [INFO] 
      [INFO] Uploaded to ossrh: https://oss.sonatype.org:443/service/local/staging/deployByRepositoryId/orgjbossforge-1214/org/jboss/forge/roaster/roaster-distribution/2.20.2.Final/roaster-distribution-2.20.2.Final.pom.asc (488 B at 474 B/s)
      [INFO] Downloading from ossrh: https://oss.sonatype.org:443/service/local/staging/deployByRepositoryId/orgjbossforge-1214/org/jboss/forge/roaster/roaster-distribution/maven-metadata.xml
      [INFO] Uploading to ossrh: https://oss.sonatype.org:443/service/local/staging/deployByRepositoryId/orgjbossforge-1214/org/jboss/forge/roaster/roaster-distribution/maven-metadata.xml
      [INFO] Progress (1): 337 B
      [INFO] 
      [INFO] Uploaded to ossrh: https://oss.sonatype.org:443/service/local/staging/deployByRepositoryId/orgjbossforge-1214/org/jboss/forge/roaster/roaster-distribution/maven-metadata.xml (337 B at 188 B/s)
      [INFO] Uploading to ossrh: https://oss.sonatype.org:443/service/local/staging/deployByRepositoryId/orgjbossforge-1214/org/jboss/forge/roaster/roaster-jdt/2.20.2.Final/roaster-jdt-2.20.2.Final.pom.asc
      [INFO] Progress (1): 488 B
      [INFO] 
      [INFO] Uploaded to ossrh: https://oss.sonatype.org:443/service/local/staging/deployByRepositoryId/orgjbossforge-1214/org/jboss/forge/roaster/roaster-jdt/2.20.2.Final/roaster-jdt-2.20.2.Final.pom.asc (488 B at 1.2 kB/s)
      [INFO] Downloading from ossrh: https://oss.sonatype.org:443/service/local/staging/deployByRepositoryId/orgjbossforge-1214/org/jboss/forge/roaster/roaster-jdt/maven-metadata.xml
      [INFO] Uploading to ossrh: https://oss.sonatype.org:443/service/local/staging/deployByRepositoryId/orgjbossforge-1214/org/jboss/forge/roaster/roaster-jdt/maven-metadata.xml
      [INFO] Progress (1): 328 B
      [INFO] 
      [INFO] Uploaded to ossrh: https://oss.sonatype.org:443/service/local/staging/deployByRepositoryId/orgjbossforge-1214/org/jboss/forge/roaster/roaster-jdt/maven-metadata.xml (328 B at 192 B/s)
      [INFO] Uploading to ossrh: https://oss.sonatype.org:443/service/local/staging/deployByRepositoryId/orgjbossforge-1214/org/jboss/forge/roaster/roaster-distribution/2.20.2.Final/roaster-distribution-2.20.2.Final-sources.jar.asc
      [INFO] Progress (1): 488 B
      [INFO] 
      [INFO] Uploaded to ossrh: https://oss.sonatype.org:443/service/local/staging/deployByRepositoryId/orgjbossforge-1214/org/jboss/forge/roaster/roaster-distribution/2.20.2.Final/roaster-distribution-2.20.2.Final-sources.jar.asc (488 B at 1.3 kB/s)
      [INFO] Uploading to ossrh: https://oss.sonatype.org:443/service/local/staging/deployByRepositoryId/orgjbossforge-1214/org/jboss/forge/roaster/roaster-api/2.20.2.Final/roaster-api-2.20.2.Final-sources.jar.asc
      [INFO] Progress (1): 488 B
      [INFO] 
      [INFO] Uploaded to ossrh: https://oss.sonatype.org:443/service/local/staging/deployByRepositoryId/orgjbossforge-1214/org/jboss/forge/roaster/roaster-api/2.20.2.Final/roaster-api-2.20.2.Final-sources.jar.asc (488 B at 1.3 kB/s)
      [INFO] Downloading from ossrh: https://oss.sonatype.org:443/service/local/staging/deployByRepositoryId/orgjbossforge-1214/org/jboss/forge/roaster/roaster-api/maven-metadata.xml
      [INFO] Uploading to ossrh: https://oss.sonatype.org:443/service/local/staging/deployByRepositoryId/orgjbossforge-1214/org/jboss/forge/roaster/roaster-api/maven-metadata.xml
      [INFO] Progress (1): 328 B
      [INFO] 
      [INFO] Uploaded to ossrh: https://oss.sonatype.org:443/service/local/staging/deployByRepositoryId/orgjbossforge-1214/org/jboss/forge/roaster/roaster-api/maven-metadata.xml (328 B at 193 B/s)
      [INFO] Uploading to ossrh: https://oss.sonatype.org:443/service/local/staging/deployByRepositoryId/orgjbossforge-1214/org/jboss/forge/roaster/roaster-tests/2.20.2.Final/roaster-tests-2.20.2.Final.jar
      [INFO] Progress (1): 2.0/2.2 kB
      [INFO] Progress (1): 2.2 kB 
      [INFO] 
      [INFO] Uploaded to ossrh: https://oss.sonatype.org:443/service/local/staging/deployByRepositoryId/orgjbossforge-1214/org/jboss/forge/roaster/roaster-tests/2.20.2.Final/roaster-tests-2.20.2.Final.jar (2.2 kB at 1.9 kB/s)
      [INFO] Uploading to ossrh: https://oss.sonatype.org:443/service/local/staging/deployByRepositoryId/orgjbossforge-1214/org/jboss/forge/roaster/roaster-tests/2.20.2.Final/roaster-tests-2.20.2.Final.pom
      [INFO] Progress (1): 854 B
      [INFO] 
      [INFO] Uploaded to ossrh: https://oss.sonatype.org:443/service/local/staging/deployByRepositoryId/orgjbossforge-1214/org/jboss/forge/roaster/roaster-tests/2.20.2.Final/roaster-tests-2.20.2.Final.pom (854 B at 740 B/s)
      [INFO] Downloading from ossrh: https://oss.sonatype.org:443/service/local/staging/deployByRepositoryId/orgjbossforge-1214/org/jboss/forge/roaster/roaster-tests/maven-metadata.xml
      [INFO] Uploading to ossrh: https://oss.sonatype.org:443/service/local/staging/deployByRepositoryId/orgjbossforge-1214/org/jboss/forge/roaster/roaster-tests/maven-metadata.xml
      [INFO] Progress (1): 330 B
      [INFO] 
      [INFO] Uploaded to ossrh: https://oss.sonatype.org:443/service/local/staging/deployByRepositoryId/orgjbossforge-1214/org/jboss/forge/roaster/roaster-tests/maven-metadata.xml (330 B at 191 B/s)
      [INFO] [ERROR] Remote staging finished with a failure: Internal error! Line "org.jboss.forge.roaster:roaster-bom:2.20.2.Final:n/a:pom:pom:n/a:n/a" does not match pattern "([^:]*):([^:]*):([^:]*):([^:]*):([^:]*):([^:]*):([^:]*):([^:]*):([^:]*):(.*)"?
      [INFO] [INFO] ------------------------------------------------------------------------
      [INFO] [INFO] Reactor Summary:
      [INFO] [INFO] 
      [INFO] [INFO] Forge Roaster - Parent 2.20.2.Final ................ SUCCESS [ 4.844 s]
      [INFO] [INFO] Forge Roaster - API ................................ SUCCESS [ 8.488 s]
      [INFO] [INFO] Forge Roaster - JDT Implementation ................. SUCCESS [ 19.542 s]
      [INFO] [INFO] Forge Roaster - BOM ................................ SUCCESS [ 3.923 s]
      [INFO] [INFO] Forge Roaster - Distribution ....................... SUCCESS [ 4.283 s]
      [INFO] [INFO] Forge Roaster - Tests 2.20.2.Final ................. FAILURE [ 24.162 s]
      [INFO] [INFO] ------------------------------------------------------------------------
      [INFO] [INFO] BUILD FAILURE
      [INFO] [INFO] ------------------------------------------------------------------------
      [INFO] [INFO] Total time: 01:06 min
      [INFO] [INFO] Finished at: 2018-10-09T16:57:41Z
      [INFO] [INFO] ------------------------------------------------------------------------
      [INFO] [ERROR] Failed to execute goal org.sonatype.plugins:nexus-staging-maven-plugin:1.6.8:deploy (injected-nexus-deploy) on project roaster-tests: Remote staging failed: Internal error! Line "org.jboss.forge.roaster:roaster-bom:2.20.2.Final:n/a:pom:pom:n/a:n/a" does not match pattern "([^:]*):([^:]*):([^:]*):([^:]*):([^:]*):([^:]*):([^:]*):([^:]*):([^:]*):(.*)"? -> [Help 1]
      [INFO] [ERROR] 
      [INFO] [ERROR] To see the full stack trace of the errors, re-run Maven with the -e switch.
      [INFO] [ERROR] Re-run Maven using the -X switch to enable full debug logging.
      [INFO] [ERROR] 
      [INFO] [ERROR] For more information about the errors and possible solutions, please read the following articles:
      [INFO] [ERROR] [Help 1] http://cwiki.apache.org/confluence/display/MAVEN/MojoExecutionException
      [INFO] [ERROR] 
      [INFO] [ERROR] After correcting the problems, you can resume the build with the command
      [INFO] [ERROR] mvn <goals> -rf :roaster-tests
      [INFO] ------------------------------------------------------------------------
      [INFO] Reactor Summary:
      [INFO] 
      [INFO] Forge Roaster - Parent 2.20.3-SNAPSHOT ............. FAILURE [01:18 min]
      [INFO] Forge Roaster - API ................................ SKIPPED
      [INFO] Forge Roaster - JDT Implementation ................. SKIPPED
      [INFO] Forge Roaster - BOM ................................ SKIPPED
      [INFO] Forge Roaster - Distribution ....................... SKIPPED
      [INFO] Forge Roaster - Tests 2.20.3-SNAPSHOT .............. SKIPPED
      [INFO] ------------------------------------------------------------------------
      [INFO] BUILD FAILURE
      [INFO] ------------------------------------------------------------------------
      [INFO] Total time: 01:20 min
      [INFO] Finished at: 2018-10-09T16:57:41Z
      [INFO] ------------------------------------------------------------------------
      [ERROR] Failed to execute goal org.apache.maven.plugins:maven-release-plugin:2.5.3:perform (default-cli) on project roaster-parent: Maven execution failed, exit code: '1' -> [Help 1]
      [ERROR] 
      [ERROR] To see the full stack trace of the errors, re-run Maven with the -e switch.
      [ERROR] Re-run Maven using the -X switch to enable full debug logging.
      [ERROR] 
      [ERROR] For more information about the errors and possible solutions, please read the following articles:
      [ERROR] [Help 1] http://cwiki.apache.org/confluence/display/MAVEN/MojoExecutionException
      

      Any advice?

        Attachments

          Issue Links

            Activity

              People

              Assignee:
              central-ossrh Central OSSRH
              Reporter:
              gastaldi George Gastaldi
              Votes:
              0 Vote for this issue
              Watchers:
              4 Start watching this issue

                Dates

                Created:
                Updated:
                Resolved:

                  tigCommentSecurity.panel-title