XMLWordPrintable

    Details

      Description

      Hello,

      first thanks for setting up my project. OSSRH-38570.

      It seems, that I cannot deploy artifacts to https://oss.sonatype.org/service/local/staging/deploy/maven2/.

       

      Here is the error code:

      [INFO] --- maven-deploy-plugin:2.7:deploy (default-deploy) @ swagger-doclet-parent ---
      [INFO] Uploading: https://oss.sonatype.org/service/local/staging/deploy/maven2/com/spirit21/swagger/swagger-doclet-parent/0.1/swagger-doclet-parent-0.1.pom
      [INFO] ------------------------------------------------------------------------
      [INFO] Reactor Summary:
      [INFO] 
      [INFO] swagger-doclet-parent .............................. FAILURE [ 15.069 s]
      [INFO] javadoc-jaxrs-swagger-doclet ....................... SKIPPED
      [INFO] javadoc-springboot-swagger-doclet .................. SKIPPED
      [INFO] ------------------------------------------------------------------------
      [INFO] BUILD FAILURE
      [INFO] ------------------------------------------------------------------------
      [INFO] Total time: 15.172 s
      [INFO] Finished at: 2018-03-21T21:50:21+01:00
      [INFO] Final Memory: 18M/115M
      [INFO] ------------------------------------------------------------------------
      [ERROR] Failed to execute goal org.apache.maven.plugins:maven-deploy-plugin:2.7:deploy (default-deploy) on project swagger-doclet-parent: Failed to deploy artifacts: Could not transfer artifact com.spirit21.swagger:swagger-doclet-parent:pom:0.1 from/to ossrh (https://oss.sonatype.org/service/local/staging/deploy/maven2): Access denied to: https://oss.sonatype.org/service/local/staging/deploy/maven2/com/spirit21/swagger/swagger-doclet-parent/0.1/swagger-doclet-parent-0.1.pom, ReasonPhrase: Forbidden. -> [Help 1]
      

       

      These common mistakes I have already checked:

      • username and password
      • the correct groupId
      • the correct settings in the pom.xml
      • the correct Maven settings.xml

      The full error log and the pom I am attaching to this post.

      Thanks in advance,
      Michael Weidmann

        Attachments

        1. error_log.txt
          60 kB
        2. pom.xml
          4 kB

          Issue Links

            Activity

              People

              Assignee:
              jorlina Joel Orlina
              Reporter:
              mweidmann Michael Weidmann
              Last Updated By:
              Joel Orlina
              Votes:
              0 Vote for this issue
              Watchers:
              3 Start watching this issue

                Dates

                Created:
                Updated:
                Resolved:
                Date of First Response:

                  tigCommentSecurity.panel-title