Uploaded image for project: 'Dev - Nexus Repo'
  1. Dev - Nexus Repo
  2. NEXUS-6667

nexus-staging:rc-release does not work with Java 8 ArrayIndexOutOfBoundsException: -1

    XMLWordPrintable

    Details

    • Type: Bug
    • Status: Closed
    • Priority: Major
    • Resolution: Duplicate
    • Affects Version/s: 2.9
    • Fix Version/s: None
    • Component/s: Build Tooling, Staging
    • Labels:
      None

      Description

      Create a staging repository in Nexus
      Set your Java to JDK 8 using nexus-staging-maven-plugin 1.6.2 and Nexus 2.9
      When you try to release the staging repository with nexus-staging:release, it fails with Java 8 but works with Java 7.

      Using mvn nexus-staging:rc-release -DstagingRepositoryId=stage-0004

      Jun 25, 2014 1:36:32 PM com.sun.jersey.api.client.filter.LoggingFilter log
      INFO: 2 * Client in-bound response
      2 < 200
      2 < Date: Wed, 25 Jun 2014 16:36:32 GMT
      2 < Date: Wed, 25 Jun 2014 16:36:32 GMT
      2 < Server: Nexus/2.9.0-SNAPSHOT
      2 < Server: Noelios-Restlet-Engine/1.1.6-SONATYPE-5348-V8
      2 < X-Frame-Options: SAMEORIGIN
      2 < X-Content-Type-Options: nosniff
      2 < Set-Cookie: rememberMe=deleteMe; Path=/nexus; Max-Age=0; Expires=Tue, 24-Jun-2014 16:36:32 GMT
      2 < Content-Type: application/xml; charset=UTF-8
      2 < Vary: Accept-Charset, Accept-Encoding, Accept-Language, Accept
      2 < Content-Length: 1320
      2 <
      <status>
      <data>
      <appName>Sonatype Nexus Professional</appName>
      <formattedAppName>Sonatype Nexus&trade; Professional Edition, Version: 2.9.0-SNAPSHOT<br>License expires in 72 days. <a href="http://links.sonatype.com/products/nexus/pro/store&quot; target="new">Renew Now</a>.</formattedAppName>
      <version>2.9.0-SNAPSHOT</version>
      <apiVersion>2.9.0-SNAPSHOT</apiVersion>
      <editionLong>Professional</editionLong>
      <editionShort>PRO</editionShort>
      <attributionsURL>http://links.sonatype.com/products/nexus/pro/attributions</attributionsURL>
      <purchaseURL>http://links.sonatype.com/products/nexus/pro/store</purchaseURL>
      <userLicenseURL>http://links.sonatype.com/products/nexus/pro/eula</userLicenseURL>
      <state>STARTED</state>
      <initializedAt>2014-06-25 16:08:40.754 UTC</initializedAt>
      <startedAt>2014-06-25 16:08:42.225 UTC</startedAt>
      <lastConfigChange>2014-06-25 16:08:42.225 UTC</lastConfigChange>
      <firstStart>false</firstStart>
      <instanceUpgraded>false</instanceUpgraded>
      <configurationUpgraded>false</configurationUpgraded>
      <baseUrl>http://localhost:8081/nexus</baseUrl>
      <licenseInstalled>true</licenseInstalled>
      <licenseExpired>false</licenseExpired>
      <trialLicense>false</trialLicense>
      </data>
      </status>

      [DEBUG] Using staging v3 service
      [INFO] RC-Releasing staging repository with IDs=[stage-1004]
      [INFO] ------------------------------------------------------------------------
      [INFO] BUILD FAILURE
      [INFO] ------------------------------------------------------------------------
      [INFO] Total time: 1.465 s
      [INFO] Finished at: 2014-06-25T13:36:32-04:00
      [INFO] Final Memory: 12M/92M
      [INFO] ------------------------------------------------------------------------
      [DEBUG] Connection manager is shutting down
      [DEBUG] Connection 0.0.0.0:61329<->127.0.0.1:8081 closed
      [DEBUG] Connection 0.0.0.0:61329<->127.0.0.1:8081 closed
      [ERROR] Failed to execute goal org.sonatype.plugins:nexus-staging-maven-plugin:1.6.1:rc-release (default-cli) on project staging-test-project: Execution default-cli of goal org.sonatype.plugins:nexus-staging-maven-plugin:1.6.1:rc-release failed: -1 -> [Help 1]
      [DEBUG] Connection manager shut down
      org.apache.maven.lifecycle.LifecycleExecutionException: Failed to execute goal org.sonatype.plugins:nexus-staging-maven-plugin:1.6.1:rc-release (default-cli) on project staging-test-project: Execution default-cli of goal org.sonatype.plugins:nexus-staging-maven-plugin:1.6.1:rc-release failed: -1
      at org.apache.maven.lifecycle.internal.MojoExecutor.execute(MojoExecutor.java:224)
      at org.apache.maven.lifecycle.internal.MojoExecutor.execute(MojoExecutor.java:153)
      at org.apache.maven.lifecycle.internal.MojoExecutor.execute(MojoExecutor.java:145)
      at org.apache.maven.lifecycle.internal.LifecycleModuleBuilder.buildProject(LifecycleModuleBuilder.java:108)
      at org.apache.maven.lifecycle.internal.LifecycleModuleBuilder.buildProject(LifecycleModuleBuilder.java:76)
      at org.apache.maven.lifecycle.internal.builder.singlethreaded.SingleThreadedBuilder.build(SingleThreadedBuilder.java:51)
      at org.apache.maven.lifecycle.internal.LifecycleStarter.execute(LifecycleStarter.java:116)
      at org.apache.maven.DefaultMaven.doExecute(DefaultMaven.java:361)
      at org.apache.maven.DefaultMaven.execute(DefaultMaven.java:155)
      at org.apache.maven.cli.MavenCli.execute(MavenCli.java:584)
      at org.apache.maven.cli.MavenCli.doMain(MavenCli.java:213)
      at org.apache.maven.cli.MavenCli.main(MavenCli.java:157)
      at sun.reflect.NativeMethodAccessorImpl.invoke0(Native Method)
      at sun.reflect.NativeMethodAccessorImpl.invoke(NativeMethodAccessorImpl.java:62)
      at sun.reflect.DelegatingMethodAccessorImpl.invoke(DelegatingMethodAccessorImpl.java:43)
      at java.lang.reflect.Method.invoke(Method.java:483)
      at org.codehaus.plexus.classworlds.launcher.Launcher.launchEnhanced(Launcher.java:289)
      at org.codehaus.plexus.classworlds.launcher.Launcher.launch(Launcher.java:229)
      at org.codehaus.plexus.classworlds.launcher.Launcher.mainWithExitCode(Launcher.java:415)
      at org.codehaus.plexus.classworlds.launcher.Launcher.main(Launcher.java:356)
      Caused by: org.apache.maven.plugin.PluginExecutionException: Execution default-cli of goal org.sonatype.plugins:nexus-staging-maven-plugin:1.6.1:rc-release failed: -1
      at org.apache.maven.plugin.DefaultBuildPluginManager.executeMojo(DefaultBuildPluginManager.java:144)
      at org.apache.maven.lifecycle.internal.MojoExecutor.execute(MojoExecutor.java:208)
      ... 19 more
      Caused by: java.lang.ArrayIndexOutOfBoundsException: -1
      at com.thoughtworks.xstream.core.util.OrderRetainingMap.entrySet(OrderRetainingMap.java:77)
      at java.util.HashMap.putMapEntries(HashMap.java:511)
      at java.util.HashMap.putAll(HashMap.java:784)
      at com.thoughtworks.xstream.core.util.OrderRetainingMap.<init>(OrderRetainingMap.java:36)
      at com.thoughtworks.xstream.converters.reflection.FieldDictionary.buildMap(FieldDictionary.java:135)
      at com.thoughtworks.xstream.converters.reflection.FieldDictionary.fieldsFor(FieldDictionary.java:76)
      at com.thoughtworks.xstream.converters.reflection.PureJavaReflectionProvider.visitSerializableFields(PureJavaReflectionProvider.java:127)
      at com.thoughtworks.xstream.converters.reflection.AbstractReflectionConverter.doMarshal(AbstractReflectionConverter.java:83)
      at com.thoughtworks.xstream.converters.reflection.AbstractReflectionConverter.marshal(AbstractReflectionConverter.java:73)
      at com.thoughtworks.xstream.core.TreeMarshaller.convert(TreeMarshaller.java:70)
      at com.thoughtworks.xstream.core.TreeMarshaller.convertAnother(TreeMarshaller.java:58)
      at com.thoughtworks.xstream.converters.reflection.AbstractReflectionConverter.marshallField(AbstractReflectionConverter.java:240)
      at com.thoughtworks.xstream.converters.reflection.AbstractReflectionConverter$2.writeField(AbstractReflectionConverter.java:216)
      at com.thoughtworks.xstream.converters.reflection.AbstractReflectionConverter$2.<init>(AbstractReflectionConverter.java:179)
      at com.thoughtworks.xstream.converters.reflection.AbstractReflectionConverter.doMarshal(AbstractReflectionConverter.java:125)
      at com.thoughtworks.xstream.converters.reflection.AbstractReflectionConverter.marshal(AbstractReflectionConverter.java:73)
      at com.thoughtworks.xstream.core.TreeMarshaller.convert(TreeMarshaller.java:70)
      at com.thoughtworks.xstream.core.TreeMarshaller.convertAnother(TreeMarshaller.java:58)
      at com.thoughtworks.xstream.converters.reflection.AbstractReflectionConverter.marshallField(AbstractReflectionConverter.java:240)
      at com.thoughtworks.xstream.converters.reflection.AbstractReflectionConverter$2.writeField(AbstractReflectionConverter.java:216)
      at com.thoughtworks.xstream.converters.reflection.AbstractReflectionConverter$2.<init>(AbstractReflectionConverter.java:179)
      at com.thoughtworks.xstream.converters.reflection.AbstractReflectionConverter.doMarshal(AbstractReflectionConverter.java:125)
      at com.thoughtworks.xstream.converters.reflection.AbstractReflectionConverter.marshal(AbstractReflectionConverter.java:73)
      at com.thoughtworks.xstream.core.TreeMarshaller.convert(TreeMarshaller.java:70)
      at com.thoughtworks.xstream.core.TreeMarshaller.convertAnother(TreeMarshaller.java:58)
      at com.thoughtworks.xstream.core.TreeMarshaller.convertAnother(TreeMarshaller.java:43)
      at com.thoughtworks.xstream.core.TreeMarshaller.start(TreeMarshaller.java:82)
      at com.thoughtworks.xstream.core.AbstractTreeMarshallingStrategy.marshal(AbstractTreeMarshallingStrategy.java:37)
      at com.thoughtworks.xstream.XStream.marshal(XStream.java:993)
      at com.thoughtworks.xstream.XStream.marshal(XStream.java:982)
      at org.sonatype.nexus.client.internal.rest.XStreamXmlProvider.getSize(XStreamXmlProvider.java:101)
      at com.sun.jersey.api.client.RequestWriter$RequestEntityWriterImpl.<init>(RequestWriter.java:202)
      at com.sun.jersey.api.client.RequestWriter.getRequestEntityWriter(RequestWriter.java:248)
      at com.sun.jersey.client.apache4.ApacheHttpClient4Handler.getHttpEntity(ApacheHttpClient4Handler.java:241)
      at com.sun.jersey.client.apache4.ApacheHttpClient4Handler.getUriHttpRequest(ApacheHttpClient4Handler.java:197)
      at com.sun.jersey.client.apache4.ApacheHttpClient4Handler.handle(ApacheHttpClient4Handler.java:153)
      at com.sun.jersey.api.client.filter.LoggingFilter.handle(LoggingFilter.java:183)
      at org.sonatype.sisu.siesta.client.filters.RequestFilters.handle(RequestFilters.java:48)
      at com.sun.jersey.api.client.Client.handle(Client.java:648)
      at com.sun.jersey.api.client.WebResource.voidHandle(WebResource.java:704)
      at com.sun.jersey.api.client.WebResource.access$400(WebResource.java:74)
      at com.sun.jersey.api.client.WebResource$Builder.post(WebResource.java:553)
      at com.sonatype.nexus.staging.client.internal.StagingWorkflowV2ServiceImpl$10.perform(StagingWorkflowV2ServiceImpl.java:280)
      at com.sonatype.nexus.staging.client.internal.StagingWorkflowV2ServiceImpl$10.perform(StagingWorkflowV2ServiceImpl.java:277)
      at com.sonatype.nexus.staging.client.internal.ExceptionConverter.runAndReturn(ExceptionConverter.java:39)
      at com.sonatype.nexus.staging.client.internal.StagingWorkflowV2ServiceImpl.releaseStagingRepositories(StagingWorkflowV2ServiceImpl.java:276)
      at com.sonatype.nexus.staging.client.internal.StagingWorkflowV3ServiceImpl.releaseStagingRepositories(StagingWorkflowV3ServiceImpl.java:92)
      at org.sonatype.nexus.maven.staging.workflow.rc.RcReleaseStageRepositoryMojo.doExecute(RcReleaseStageRepositoryMojo.java:65)
      at org.sonatype.nexus.maven.staging.workflow.AbstractStagingActionMojo.execute(AbstractStagingActionMojo.java:56)
      at org.apache.maven.plugin.DefaultBuildPluginManager.executeMojo(DefaultBuildPluginManager.java:133)
      ... 20 more
      [ERROR]
      [ERROR]
      [ERROR] For more information about the errors and possible solutions, please read the following articles:
      [ERROR] [Help 1] http://cwiki.apache.org/confluence/display/MAVEN/PluginExecutionException

        Attachments

          Issue Links

            Activity

              People

              Assignee:
              Unassigned
              Reporter:
              plynch Peter Lynch
              Last Updated By:
              Peter Lynch
              Votes:
              0 Vote for this issue
              Watchers:
              1 Start watching this issue

                Dates

                Created:
                Updated:
                Resolved:

                  tigCommentSecurity.panel-title